Reaction Details
TargetAngiopoietin-1 receptor
LigandBDBM50243931
Substrate/Competitorn/a
Meas. Tech.ChEMBL_555009 (CHEMBL957984)
IC50 1700±n/a nM
Citation Peifer, CSelig, RKinkel, KOtt, DTotzke, FSchächtele, CHeidenreich, RRöcken, MSchollmeyer, DLaufer, S Design, synthesis, and biological evaluation of novel 3-aryl-4-(1H-indole-3yl)-1,5-dihydro-2H-pyrrole-2-ones as vascular endothelial growth factor receptor (VEGF-R) inhibitors. J Med Chem51:3814-24 (2008) 
 
Angiopoietin-1 receptor
Name:Angiopoietin-1 receptor
Type:Enzyme
Mol. Mass.:125835.70
Organism:Homo sapiens (Human)
Description:Q02763
Residue:1124
BDBM50243931
NameBDBM50243931
Synonyms:4-[1-(Phenoxymethyl)-1H-indol-3-yl]-3-(3,4,5-trimethoxyphenyl)-1,5-dihydro-2H-pyrrole-2-one | CHEMBL488811
TypeSmall organic molecule
Emp. Form.C28H26N2O5
Mol. Mass.470.5164
SMILESCOc1cc(cc(OC)c1OC)C1=C(CNC1=O)c1cn(COc2ccccc2)c2ccccc12