Reaction Details
TargetNociceptin receptor
LigandBDBM50243727
Substrate/Competitorn/a
Meas. Tech.ChEMBL_491435 (CHEMBL948530)
IC50 7.3±n/a nM
Citation Yoshizumi, TTakahashi, HMiyazoe, HSugimoto, YTsujita, TKato, TIto, HKawamoto, HHirayama, MIchikawa, DAzuma-Kanoh, TOzaki, SShibata, YTani, TChiba, MIshii, YOkuda, STadano, KFukuroda, TOkamoto, OOhta, H A novel class of cycloalkano[b]pyridines as potent and orally active opioid receptor-like 1 antagonists with minimal binding affinity to the hERG K+ channel. J Med Chem51:4021-9 (2008) 
 
Nociceptin receptor
Name:Nociceptin receptor
Type:G Protein-Coupled Receptor (GPCR)
Mol. Mass.:40702.87
Organism:Homo sapiens (Human)
Description:P41146
Residue:370
BDBM50243727
NameBDBM50243727
Synonyms:(7R,9S)-7-(((3S,4R)-3-(hydroxymethyl)-4-o-tolylpiperidin-1-yl)methyl)-6,7,8,9-tetrahydro-5H-cyclohepta[b]pyridin-9-ol | CHEMBL472125
TypeSmall organic molecule
Emp. Form.C24H32N2O2
Mol. Mass.380.5231
SMILESCc1ccccc1[C@@H]1CCN(C[C@@H]2CCc3cccnc3[C@@H](O)C2)C[C@H]1CO