Reaction Details
TargetNociceptin receptor
LigandBDBM50244295
Substrate/Competitorn/a
Meas. Tech.ChEMBL_491434 (CHEMBL948529)
Ki 18.0±n/a nM
Citation Yoshizumi, TTakahashi, HMiyazoe, HSugimoto, YTsujita, TKato, TIto, HKawamoto, HHirayama, MIchikawa, DAzuma-Kanoh, TOzaki, SShibata, YTani, TChiba, MIshii, YOkuda, STadano, KFukuroda, TOkamoto, OOhta, H A novel class of cycloalkano[b]pyridines as potent and orally active opioid receptor-like 1 antagonists with minimal binding affinity to the hERG K+ channel. J Med Chem51:4021-9 (2008) 
 
Nociceptin receptor
Name:Nociceptin receptor
Type:G Protein-Coupled Receptor (GPCR)
Mol. Mass.:40702.87
Organism:Homo sapiens (Human)
Description:P41146
Residue:370
BDBM50244295
NameBDBM50244295
Synonyms:(-)-7-((4-o-tolylpiperidin-1-yl)methyl)-6,7,8,9-tetrahydro-5H-cyclohepta[b]pyridin-9-ol cis-(+)-7-((4-o-tolylpiperidin-1-yl)methyl)-6,7,8,9-tetrahydro-5H-cyclohepta[b]pyridin-9-ol
TypeSmall organic molecule
Emp. Form.C23H30N2O
Mol. Mass.350.4971
SMILESCc1ccccc1C1CCN(C[C@H]2CCc3cccnc3[C@@H](O)C2)CC1