Reaction Details
TargetNociceptin receptor
LigandBDBM50244372
Substrate/Competitorn/a
Meas. Tech.ChEMBL_491434 (CHEMBL948529)
Ki 20±n/a nM
Citation Yoshizumi, TTakahashi, HMiyazoe, HSugimoto, YTsujita, TKato, TIto, HKawamoto, HHirayama, MIchikawa, DAzuma-Kanoh, TOzaki, SShibata, YTani, TChiba, MIshii, YOkuda, STadano, KFukuroda, TOkamoto, OOhta, H A novel class of cycloalkano[b]pyridines as potent and orally active opioid receptor-like 1 antagonists with minimal binding affinity to the hERG K+ channel. J Med Chem51:4021-9 (2008) 
 
Nociceptin receptor
Name:Nociceptin receptor
Type:G Protein-Coupled Receptor (GPCR)
Mol. Mass.:40702.87
Organism:Homo sapiens (Human)
Description:P41146
Residue:370
BDBM50244372
NameBDBM50244372
Synonyms:(7R,9S)-7-((4-o-tolylpiperazin-1-yl)methyl)-6,7,8,9-tetrahydro-5H-cyclohepta[b]pyridin-9-ol | CHEMBL487826
TypeSmall organic molecule
Emp. Form.C22H29N3O
Mol. Mass.351.4852
SMILESCc1ccccc1N1CCN(C[C@@H]2CCc3cccnc3[C@@H](O)C2)CC1