Reaction Details
TargetPotassium voltage-gated channel subfamily H member 2
LigandBDBM50243730
Substrate/Competitorn/a
Meas. Tech.ChEMBL_491437 (CHEMBL948532)
IC50 13000±n/a nM
Citation Yoshizumi, TTakahashi, HMiyazoe, HSugimoto, YTsujita, TKato, TIto, HKawamoto, HHirayama, MIchikawa, DAzuma-Kanoh, TOzaki, SShibata, YTani, TChiba, MIshii, YOkuda, STadano, KFukuroda, TOkamoto, OOhta, H A novel class of cycloalkano[b]pyridines as potent and orally active opioid receptor-like 1 antagonists with minimal binding affinity to the hERG K+ channel. J Med Chem51:4021-9 (2008) 
 
Potassium voltage-gated channel subfamily H member 2
Name:Potassium voltage-gated channel subfamily H member 2
Type:Multi-pass membrane protein
Mol. Mass.:126672.65
Organism:Homo sapiens (Human)
Description:Q12809
Residue:1159
BDBM50243730
NameBDBM50243730
Synonyms:(7R,9S)-7-(((3R,4R)-4-(2-chloro-4-fluorophenyl)-3-hydroxypiperidin-1-yl)methyl)-6,7,8,9-tetrahydro-5H-cyclohepta[b]pyridin-9-ol | CHEMBL513423
TypeSmall organic molecule
Emp. Form.C22H26ClFN2O2
Mol. Mass.404.905
SMILESO[C@H]1CN(C[C@@H]2CCc3cccnc3[C@@H](O)C2)CC[C@@H]1c1ccc(F)cc1Cl