Reaction Details
TargetPotassium voltage-gated channel subfamily H member 2
LigandBDBM50243728
Substrate/Competitorn/a
Meas. Tech.ChEMBL_491437 (CHEMBL948532)
IC50 40000±n/a nM
Citation Yoshizumi, TTakahashi, HMiyazoe, HSugimoto, YTsujita, TKato, TIto, HKawamoto, HHirayama, MIchikawa, DAzuma-Kanoh, TOzaki, SShibata, YTani, TChiba, MIshii, YOkuda, STadano, KFukuroda, TOkamoto, OOhta, H A novel class of cycloalkano[b]pyridines as potent and orally active opioid receptor-like 1 antagonists with minimal binding affinity to the hERG K+ channel. J Med Chem51:4021-9 (2008) 
 
Potassium voltage-gated channel subfamily H member 2
Name:Potassium voltage-gated channel subfamily H member 2
Type:Multi-pass membrane protein
Mol. Mass.:126672.65
Organism:Homo sapiens (Human)
Description:Q12809
Residue:1159
BDBM50243728
NameBDBM50243728
Synonyms:(7R,9S)-7-(((3S,4S)-3-hydroxy-4-o-tolylpiperidin-1-yl)methyl)-6,7,8,9-tetrahydro-5H-cyclohepta[b]pyridin-9-ol | CHEMBL512896
TypeSmall organic molecule
Emp. Form.C23H30N2O2
Mol. Mass.366.4965
SMILESCc1ccccc1[C@@H]1CCN(C[C@@H]2CCc3cccnc3[C@@H](O)C2)C[C@H]1O