Reaction Details
TargetC-C chemokine receptor type 5
LigandBDBM50123136
Substrate/Competitorn/a
Meas. Tech.ChEMBL_500129 (CHEMBL974332)
IC50 1.8±n/a nM
Citation Zhuo, YKong, RCong, XJChen, WZWang, CX Three-dimensional QSAR analyses of 1,3,4-trisubstituted pyrrolidine-based CCR5 receptor inhibitors. Eur J Med Chem43:2724-34 (2008) 
 
C-C chemokine receptor type 5
Name:C-C chemokine receptor type 5
Type:Enzyme
Mol. Mass.:40540.21
Organism:Homo sapiens (Human)
Description:P51681
Residue:352
BDBM50123136
NameBDBM50123136
Synonyms:(R)-3-Cyclobutyl-2-{(3S,4S)-3-(3-fluoro-phenyl)-4-[4-(propyl-pyrimidin-2-yl-amino)-piperidin-1-ylmethyl]-pyrrolidin-1-yl}-propionic acid CHEMBL428104
TypeSmall organic molecule
Emp. Form.C30H42FN5O2
Mol. Mass.523.6852
SMILESCCCN(C1CCN(C[C@H]2CN(C[C@@H]2c2cccc(F)c2)[C@H](CC2CCC2)C(O)=O)CC1)c1ncccn1