Reaction Details
TargetC-C chemokine receptor type 5
LigandBDBM50249334
Substrate/Competitorn/a
Meas. Tech.ChEMBL_500129 (CHEMBL974332)
IC50 0.51±n/a nM
Citation Zhuo, YKong, RCong, XJChen, WZWang, CX Three-dimensional QSAR analyses of 1,3,4-trisubstituted pyrrolidine-based CCR5 receptor inhibitors. Eur J Med Chem43:2724-34 (2008) 
 
C-C chemokine receptor type 5
Name:C-C chemokine receptor type 5
Type:Enzyme
Mol. Mass.:40540.21
Organism:Homo sapiens (Human)
Description:P51681
Residue:352
BDBM50249334
NameBDBM50249334
Synonyms:(R)-2-((3S,4S)-3-((4-(2-benzylthiazol-5-yl)piperidin-1-yl)methyl)-4-phenylpyrrolidin-1-yl)-3-methylbutanoic acid | CHEMBL513564
TypeSmall organic molecule
Emp. Form.C31H39N3O2S
Mol. Mass.517.725
SMILESCC(C)[C@@H](N1C[C@H](CN2CCC(CC2)c2cnc(Cc3ccccc3)s2)[C@H](C1)c1ccccc1)C(O)=O