Reaction Details
TargetC-C chemokine receptor type 5
LigandBDBM50119349
Substrate/Competitorn/a
Meas. Tech.ChEMBL_500129 (CHEMBL974332)
IC50 0.1±n/a nM
Citation Zhuo, YKong, RCong, XJChen, WZWang, CX Three-dimensional QSAR analyses of 1,3,4-trisubstituted pyrrolidine-based CCR5 receptor inhibitors. Eur J Med Chem43:2724-34 (2008) 
 
C-C chemokine receptor type 5
Name:C-C chemokine receptor type 5
Type:Enzyme
Mol. Mass.:40540.21
Organism:Homo sapiens (Human)
Description:P51681
Residue:352
BDBM50119349
NameBDBM50119349
Synonyms:(R)-2-cyclobutyl-2-((3S,4S)-3-phenyl-4-((4-(3-phenylpropyl)piperidin-1-yl)methyl)pyrrolidin-1-yl)acetic acid CHEMBL320386
TypeSmall organic molecule
Emp. Form.C31H42N2O2
Mol. Mass.474.6774
SMILESOC(=O)[C@@H](C1CCC1)N1C[C@H](CN2CCC(CCCc3ccccc3)CC2)[C@H](C1)c1ccccc1