Reaction Details
TargetC-C chemokine receptor type 5
LigandBDBM50119321
Substrate/Competitorn/a
Meas. Tech.ChEMBL_500129 (CHEMBL974332)
IC50 0.2±n/a nM
Citation Zhuo, YKong, RCong, XJChen, WZWang, CX Three-dimensional QSAR analyses of 1,3,4-trisubstituted pyrrolidine-based CCR5 receptor inhibitors. Eur J Med Chem43:2724-34 (2008) 
 
C-C chemokine receptor type 5
Name:C-C chemokine receptor type 5
Type:Enzyme
Mol. Mass.:40540.21
Organism:Homo sapiens (Human)
Description:P51681
Residue:352
BDBM50119321
NameBDBM50119321
Synonyms:1-(1-Cyclohexylmethyl-4-phenyl-pyrrolidin-3-ylmethyl)-4-{3-[4-(1H-tetrazol-5-yl)-phenyl]-propyl}-piperidin-4-ol 4-(3-(4-(1H-tetrazol-5-yl)phenyl)propyl)-1-(((3S,4S)-1-(cyclohexylmethyl)-4-phenylpyrrolidin-3-yl)methyl)piperidin-4-ol | CHEMBL319593
TypeSmall organic molecule
Emp. Form.C33H46N6O
Mol. Mass.542.7579
SMILESOC1(CCCc2ccc(cc2)-c2nnn[nH]2)CCN(C[C@H]2CN(CC3CCCCC3)C[C@@H]2c2ccccc2)CC1