Reaction Details
TargetC-C chemokine receptor type 5
LigandBDBM50119345
Substrate/Competitorn/a
Meas. Tech.ChEMBL_500129 (CHEMBL974332)
IC50 2±n/a nM
Citation Zhuo, YKong, RCong, XJChen, WZWang, CX Three-dimensional QSAR analyses of 1,3,4-trisubstituted pyrrolidine-based CCR5 receptor inhibitors. Eur J Med Chem43:2724-34 (2008) 
 
C-C chemokine receptor type 5
Name:C-C chemokine receptor type 5
Type:Enzyme
Mol. Mass.:40540.21
Organism:Homo sapiens (Human)
Description:P51681
Residue:352
BDBM50119345
NameBDBM50119345
Synonyms:(R)-2-((3S,4S)-3-((4-hydroxy-4-(3-phenylpropyl)piperidin-1-yl)methyl)-4-phenylpyrrolidin-1-yl)-3-methylbutanoic acid CHEMBL318210
TypeSmall organic molecule
Emp. Form.C30H42N2O3
Mol. Mass.478.6661
SMILESCC(C)[C@@H](N1C[C@H](CN2CCC(O)(CCCc3ccccc3)CC2)[C@H](C1)c1ccccc1)C(O)=O