Reaction Details
TargetGastric inhibitory polypeptide
LigandBDBM50244265
Substrate/Competitorn/a
Meas. Tech.ChEMBL_491828 (CHEMBL945218)
IC50 4900±n/a nM
Citation Kim, RMChang, JLins, ARBrady, ECandelore, MRDallas-Yang, QDing, VDragovic, JIliff, SJiang, GMock, SQureshi, SSaperstein, RSzalkowski, DTamvakopoulos, CTota, LWright, MYang, XTata, JRChapman, KZhang, BBParmee, ER Discovery of potent, orally active benzimidazole glucagon receptor antagonists. Bioorg Med Chem Lett18:3701-5 (2008) 
 
Gastric inhibitory polypeptide
Name:Gastric inhibitory polypeptide
Type:PROTEIN
Mol. Mass.:17110.38
Organism:Homo sapiens (Human)
Description:ChEMBL_491828
Residue:153
BDBM50244265
NameBDBM50244265
Synonyms:CHEMBL480113 | trans-4-((4-tert-butylcyclohexyl)(1-methyl-6-propoxy-1H-benzo[d]imidazol-2-yl)amino)methyl)-N-(1H-tetrazol-5-yl)benzamide
TypeSmall organic molecule
Emp. Form.C30H40N8O2
Mol. Mass.544.691
SMILESCCCOc1ccc2nc(N(Cc3ccc(cc3)C(=O)Nc3nnn[nH]3)[C@H]3CC[C@@H](CC3)C(C)(C)C)n(C)c2c1