Reaction Details
TargetC-C chemokine receptor type 4
LigandBDBM50243945
Substrate/Competitorn/a
Meas. Tech.ChEMBL_491886 (CHEMBL946416)
IC50 73±n/a nM
Citation Yokoyama, KIshikawa, NIgarashi, SKawano, NHattori, KMiyazaki, TOgino, SMatsumoto, YTakeuchi, MOhta, M Discovery of potent CCR4 antagonists: Synthesis and structure-activity relationship study of 2,4-diaminoquinazolines. Bioorg Med Chem16:7021-32 (2008) 
 
C-C chemokine receptor type 4
Name:C-C chemokine receptor type 4
Type:Enzyme
Mol. Mass.:41406.41
Organism:Homo sapiens (Human)
Description:P51679
Residue:360
BDBM50243945
NameBDBM50243945
Synonyms:2-(1,4'-Bipiperidine-1'-yl)-N-cycloheptyl-6,7-dimethoxyquinazolin-4-amine CHEMBL508207 | N-cycloheptyl-6,7-dimethoxy-2-(4-(piperidin-1-yl)piperidin-1-yl)quinazolin-4-amine
TypeSmall organic molecule
Emp. Form.C27H41N5O2
Mol. Mass.467.6467
SMILESCOc1cc2nc(nc(NC3CCCCCC3)c2cc1OC)N1CCC(CC1)N1CCCCC1