Reaction Details
TargetIntegrin alpha-4
LigandBDBM50243818
Substrate/Competitorn/a
Meas. Tech.ChEMBL_492185 (CHEMBL951561)
IC50 9±n/a nM
Citation Phillips, DJDavenport, RJDemaude, TAGalleway, FPJones, MWKnerr, LPerry, BGRatcliffe, AJ Imidazopyridines as VLA-4 integrin antagonists. Bioorg Med Chem Lett18:4146-9 (2008) 
 
Integrin alpha-4
Name:Integrin alpha-4
Type:Membrane Protein
Mol. Mass.:114897.35
Organism:Homo sapiens (Human)
Description:P13612
Residue:1032
BDBM50243818
NameBDBM50243818
Synonyms:(S)-2-(2-Bromo-3-oxo-spiro[3.5]non-1-en-1-ylamino)-3-[4-(2-isopropyl-imidazo[4,5-b]pyridin-3-yl)-phenyl]-propionic acid | CHEMBL486444
TypeSmall organic molecule
Emp. Form.C27H29BrN4O3
Mol. Mass.537.448
SMILESCC(C)c1nc2cccnc2n1-c1ccc(C[C@H](NC2=C(Br)C(=O)C22CCCCC2)C(O)=O)cc1