Reaction Details
TargetIntegrin alpha-4
LigandBDBM50244341
Substrate/Competitorn/a
Meas. Tech.ChEMBL_492185 (CHEMBL951561)
IC50 19±n/a nM
Citation Phillips, DJDavenport, RJDemaude, TAGalleway, FPJones, MWKnerr, LPerry, BGRatcliffe, AJ Imidazopyridines as VLA-4 integrin antagonists. Bioorg Med Chem Lett18:4146-9 (2008) 
 
Integrin alpha-4
Name:Integrin alpha-4
Type:Membrane Protein
Mol. Mass.:114897.35
Organism:Homo sapiens (Human)
Description:P13612
Residue:1032
BDBM50244341
NameBDBM50244341
Synonyms:(2S)-2-(2-chloro-4,4-dimethyl-3-oxocyclobut-1-enylamino)-3-(4-(2-(pyridin-3-yl)-3H-imidazo[4,5-b]pyridin-3-yl)phenyl)propanoic acid | CHEMBL471302
TypeSmall organic molecule
Emp. Form.C26H22ClN5O3
Mol. Mass.487.938
SMILESCC1(C)C(=O)C(Cl)=C1N[C@@H](Cc1ccc(cc1)-n1c(nc2cccnc12)-c1cccnc1)C(O)=O