Reaction Details
TargetCalmodulin-sensitive adenylate cyclase
LigandBDBM50243787
Substrate/Competitorn/a
Meas. Tech.ChEMBL_492206 (CHEMBL951582)
IC50>100000±n/a nM
Citation Jimenez, MEBush, KPawlik, JSower, LPeterson, JWGilbertson, SR Synthesis and screening of small molecule inhibitors of anthrax edema factor. Bioorg Med Chem Lett18:4215-8 (2008) 
 
Calmodulin-sensitive adenylate cyclase
Name:Calmodulin-sensitive adenylate cyclase
Type:PROTEIN
Mol. Mass.:92481.33
Organism:Bacillus anthracis
Description:ChEMBL_606615
Residue:800
BDBM50243787
NameBDBM50243787
Synonyms:3-phenylcyclohex-2-enone | CHEMBL503170
TypeSmall organic molecule
Emp. Form.C12H12O
Mol. Mass.172.2231
SMILESO=C1CCCC(=C1)c1ccccc1