Reaction Details
TargetCalmodulin-sensitive adenylate cyclase
LigandBDBM50243836
Substrate/Competitorn/a
Meas. Tech.ChEMBL_492206 (CHEMBL951582)
IC50 35000±n/a nM
Citation Jimenez, MEBush, KPawlik, JSower, LPeterson, JWGilbertson, SR Synthesis and screening of small molecule inhibitors of anthrax edema factor. Bioorg Med Chem Lett18:4215-8 (2008) 
 
Calmodulin-sensitive adenylate cyclase
Name:Calmodulin-sensitive adenylate cyclase
Type:PROTEIN
Mol. Mass.:92481.33
Organism:Bacillus anthracis
Description:ChEMBL_606615
Residue:800
BDBM50243836
NameBDBM50243836
Synonyms:3-(2-methoxyphenyl)cyclohex-2-enone | CHEMBL486251
TypeSmall organic molecule
Emp. Form.C13H14O2
Mol. Mass.202.2491
SMILESCOc1ccccc1C1=CC(=O)CCC1