Reaction Details
TargetCalmodulin-sensitive adenylate cyclase
LigandBDBM50243835
Substrate/Competitorn/a
Meas. Tech.ChEMBL_492206 (CHEMBL951582)
IC50>100000±n/a nM
Citation Jimenez, MEBush, KPawlik, JSower, LPeterson, JWGilbertson, SR Synthesis and screening of small molecule inhibitors of anthrax edema factor. Bioorg Med Chem Lett18:4215-8 (2008) 
 
Calmodulin-sensitive adenylate cyclase
Name:Calmodulin-sensitive adenylate cyclase
Type:PROTEIN
Mol. Mass.:92481.33
Organism:Bacillus anthracis
Description:ChEMBL_606615
Residue:800
BDBM50243835
NameBDBM50243835
Synonyms:3-Dibenzofuran-4-yl-5,5-dimethyl-cyclohex-2-enone | CHEMBL519551
TypeSmall organic molecule
Emp. Form.C20H18O2
Mol. Mass.290.3557
SMILESCC1(C)CC(=O)C=C(C1)c1cccc2c1oc1ccccc21