Reaction Details
TargetCalmodulin-sensitive adenylate cyclase
LigandBDBM50243791
Substrate/Competitorn/a
Meas. Tech.ChEMBL_492206 (CHEMBL951582)
IC50>100000±n/a nM
Citation Jimenez, MEBush, KPawlik, JSower, LPeterson, JWGilbertson, SR Synthesis and screening of small molecule inhibitors of anthrax edema factor. Bioorg Med Chem Lett18:4215-8 (2008) 
 
Calmodulin-sensitive adenylate cyclase
Name:Calmodulin-sensitive adenylate cyclase
Type:PROTEIN
Mol. Mass.:92481.33
Organism:Bacillus anthracis
Description:ChEMBL_606615
Residue:800
BDBM50243791
NameBDBM50243791
Synonyms:3-(3-hydroxyphenyl)cyclohex-2-enone | CHEMBL488651
TypeSmall organic molecule
Emp. Form.C12H12O2
Mol. Mass.188.2225
SMILESOc1cccc(c1)C1=CC(=O)CCC1