Reaction Details
TargetCalmodulin-sensitive adenylate cyclase
LigandBDBM50243834
Substrate/Competitorn/a
Meas. Tech.ChEMBL_492206 (CHEMBL951582)
IC50 56000±n/a nM
Citation Jimenez, MEBush, KPawlik, JSower, LPeterson, JWGilbertson, SR Synthesis and screening of small molecule inhibitors of anthrax edema factor. Bioorg Med Chem Lett18:4215-8 (2008) 
 
Calmodulin-sensitive adenylate cyclase
Name:Calmodulin-sensitive adenylate cyclase
Type:PROTEIN
Mol. Mass.:92481.33
Organism:Bacillus anthracis
Description:ChEMBL_606615
Residue:800
BDBM50243834
NameBDBM50243834
Synonyms:3-(1H-indol-5-yl)cyclohex-2-enone | CHEMBL449336
TypeSmall organic molecule
Emp. Form.C14H13NO
Mol. Mass.211.2591
SMILESO=C1CCCC(=C1)c1ccc2[nH]ccc2c1