Reaction Details
TargetCalmodulin-sensitive adenylate cyclase
LigandBDBM50243831
Substrate/Competitorn/a
Meas. Tech.ChEMBL_492206 (CHEMBL951582)
IC50 24000±n/a nM
Citation Jimenez, MEBush, KPawlik, JSower, LPeterson, JWGilbertson, SR Synthesis and screening of small molecule inhibitors of anthrax edema factor. Bioorg Med Chem Lett18:4215-8 (2008) 
 
Calmodulin-sensitive adenylate cyclase
Name:Calmodulin-sensitive adenylate cyclase
Type:PROTEIN
Mol. Mass.:92481.33
Organism:Bacillus anthracis
Description:ChEMBL_606615
Residue:800
BDBM50243831
NameBDBM50243831
Synonyms:3-(6-methoxypyridin-3-yl)-2-methylcyclopent-2-enone | CHEMBL502143
TypeSmall organic molecule
Emp. Form.C12H13NO2
Mol. Mass.203.2371
SMILESCOc1ccc(cn1)C1=C(C)C(=O)CC1