Reaction Details
TargetCalmodulin-sensitive adenylate cyclase
LigandBDBM50243830
Substrate/Competitorn/a
Meas. Tech.ChEMBL_492206 (CHEMBL951582)
IC50>100000±n/a nM
Citation Jimenez, MEBush, KPawlik, JSower, LPeterson, JWGilbertson, SR Synthesis and screening of small molecule inhibitors of anthrax edema factor. Bioorg Med Chem Lett18:4215-8 (2008) 
 
Calmodulin-sensitive adenylate cyclase
Name:Calmodulin-sensitive adenylate cyclase
Type:PROTEIN
Mol. Mass.:92481.33
Organism:Bacillus anthracis
Description:ChEMBL_606615
Residue:800
BDBM50243830
NameBDBM50243830
Synonyms:3-(furan-3-yl)cyclohex-2-enone | CHEMBL486250
TypeSmall organic molecule
Emp. Form.C10H10O2
Mol. Mass.162.1852
SMILESO=C1CCCC(=C1)c1ccoc1