Reaction Details
TargetSerine/threonine-protein kinase Chk1
LigandBDBM50243047
Substrate/Competitorn/a
Meas. Tech.ChEMBL_491561 (CHEMBL944207)
IC50 5±n/a nM
Citation Janetka, JWAlmeida, LAshwell, SBrassil, PJDaly, KDeng, CGero, TGlynn, REHorn, CLIoannidis, SLyne, PNewcombe, NJOza, VBPass, MSpringer, SKSu, MToader, DVasbinder, MMYu, DYu, YZabludoff, SD Discovery of a novel class of 2-ureido thiophene carboxamide checkpoint kinase inhibitors. Bioorg Med Chem Lett18:4242-8 (2008) 
 
Serine/threonine-protein kinase Chk1
Name:Serine/threonine-protein kinase Chk1
Type:Enzyme Catalytic Domain
Mol. Mass.:54443.02
Organism:Homo sapiens (Human)
Description:gi_166295192
Residue:476
BDBM50243047
NameBDBM50243047
Synonyms:1-(3-((S)-piperidin-3-ylcarbamoyl)-5-(3-carbamoylphenyl)thiophen-2-yl)urea | CHEMBL470289
TypeSmall organic molecule
Emp. Form.C18H21N5O3S
Mol. Mass.387.456
SMILESNC(=O)Nc1sc(cc1C(=O)N[C@H]1CCCNC1)-c1cccc(c1)C(N)=O