Reaction Details
TargetSerine/threonine-protein kinase Chk1
LigandBDBM50243151
Substrate/Competitorn/a
Meas. Tech.ChEMBL_491561 (CHEMBL944207)
IC50 4±n/a nM
Citation Janetka, JWAlmeida, LAshwell, SBrassil, PJDaly, KDeng, CGero, TGlynn, REHorn, CLIoannidis, SLyne, PNewcombe, NJOza, VBPass, MSpringer, SKSu, MToader, DVasbinder, MMYu, DYu, YZabludoff, SD Discovery of a novel class of 2-ureido thiophene carboxamide checkpoint kinase inhibitors. Bioorg Med Chem Lett18:4242-8 (2008) 
 
Serine/threonine-protein kinase Chk1
Name:Serine/threonine-protein kinase Chk1
Type:Enzyme Catalytic Domain
Mol. Mass.:54443.02
Organism:Homo sapiens (Human)
Description:gi_166295192
Residue:476
BDBM50243151
NameBDBM50243151
Synonyms:(S)-1-(3-(piperidin-3-ylcarbamoyl)-5-(pyridin-4-yl)thiophen-2-yl)urea | CHEMBL488231
TypeSmall organic molecule
Emp. Form.C16H19N5O2S
Mol. Mass.345.419
SMILESNC(=O)Nc1sc(cc1C(=O)N[C@H]1CCCNC1)-c1ccncc1