Reaction Details
TargetCyclin-dependent kinase 2-associated protein 1
LigandBDBM50243150
Substrate/Competitorn/a
Meas. Tech.ChEMBL_491562 (CHEMBL944208)
IC50 3300±n/a nM
Citation Janetka, JWAlmeida, LAshwell, SBrassil, PJDaly, KDeng, CGero, TGlynn, REHorn, CLIoannidis, SLyne, PNewcombe, NJOza, VBPass, MSpringer, SKSu, MToader, DVasbinder, MMYu, DYu, YZabludoff, SD Discovery of a novel class of 2-ureido thiophene carboxamide checkpoint kinase inhibitors. Bioorg Med Chem Lett18:4242-8 (2008) 
 
Cyclin-dependent kinase 2-associated protein 1
Name:Cyclin-dependent kinase 2-associated protein 1
Type:PROTEIN
Mol. Mass.:12370.40
Organism:Homo sapiens (Human)
Description:ChEMBL_491562
Residue:115
BDBM50243150
NameBDBM50243150
Synonyms:1-(3-((S)-piperidin-3-ylcarbamoyl)-5-(pyridin-3-yl)thiophen-2-yl)urea | CHEMBL488230
TypeSmall organic molecule
Emp. Form.C16H19N5O2S
Mol. Mass.345.419
SMILESNC(=O)Nc1sc(cc1C(=O)N[C@H]1CCCNC1)-c1cccnc1