Reaction Details
TargetSubstance-P receptor
LigandBDBM50243428
Substrate/Competitorn/a
Meas. Tech.ChEMBL_491574 (CHEMBL944220)
Ki 0.2±n/a nM
Citation Paliwal, SReichard, GAShah, SWrobleski, MLWang, CStengone, CTsui, HCXiao, DDuffy, RALachowicz, JENomeir, AAVarty, GBShih, NY Discovery of a novel, potent and orally active series of gamma-lactams as selective NK1 antagonists. Bioorg Med Chem Lett18:4168-71 (2008) 
 
Substance-P receptor
Name:Substance-P receptor
Type:G Protein-Coupled Receptor (GPCR)
Mol. Mass.:46254.43
Organism:Homo sapiens (Human)
Description:P25103
Residue:407
BDBM50243428
NameBDBM50243428
Synonyms:1-((3R,5S)-5-(((R)-1-(3,5-bis(trifluoromethyl)phenyl)ethoxy)methyl)-2-oxo-5-phenylpyrrolidin-3-yl)piperidin-2-one | CHEMBL508661
TypeSmall organic molecule
Emp. Form.C26H26F6N2O3
Mol. Mass.528.4867
SMILESC[C@@H](OC[C@]1(C[C@@H](N2CCCCC2=O)C(=O)N1)c1ccccc1)c1cc(cc(c1)C(F)(F)F)C(F)(F)F