Reaction Details
TargetSubstance-P receptor
LigandBDBM50177387
Substrate/Competitorn/a
Meas. Tech.ChEMBL_491574 (CHEMBL944220)
Ki 0.6±n/a nM
Citation Paliwal, SReichard, GAShah, SWrobleski, MLWang, CStengone, CTsui, HCXiao, DDuffy, RALachowicz, JENomeir, AAVarty, GBShih, NY Discovery of a novel, potent and orally active series of gamma-lactams as selective NK1 antagonists. Bioorg Med Chem Lett18:4168-71 (2008) 
 
Substance-P receptor
Name:Substance-P receptor
Type:G Protein-Coupled Receptor (GPCR)
Mol. Mass.:46254.43
Organism:Homo sapiens (Human)
Description:P25103
Residue:407
BDBM50177387
NameBDBM50177387
Synonyms:(R)-4-(((R)-1-(3,5-bis(trifluoromethyl)phenyl)ethoxy)methyl)-4-phenylimidazolidin-2-one | CHEMBL204306
TypeSmall organic molecule
Emp. Form.C20H18F6N2O2
Mol. Mass.432.3595
SMILESC[C@@H](OC[C@]1(CNC(=O)N1)c1ccccc1)c1cc(cc(c1)C(F)(F)F)C(F)(F)F