Reaction Details
TargetCoagulation factor X
LigandBDBM50243591
Substrate/Competitorn/a
Meas. Tech.ChEMBL_491893 (CHEMBL946423)
Ki 0.12±n/a nM
Citation Qiao, JXCheney, DLAlexander, RSSmallwood, AMKing, SRHe, KRendina, ARLuettgen, JMKnabb, RMWexler, RRLam, PY Achieving structural diversity using the perpendicular conformation of alpha-substituted phenylcyclopropanes to mimic the bioactive conformation of ortho-substituted biphenyl P4 moieties: discovery of novel, highly potent inhibitors of Factor Xa. Bioorg Med Chem Lett18:4118-23 (2008) 
 
Coagulation factor X
Name:Coagulation factor X
Type:Enzyme
Mol. Mass.:54726.60
Organism:Homo sapiens (Human)
Description:n/a
Residue:488
BDBM50243591
NameBDBM50243591
Synonyms:6-(4-(1-((cyclopentylamino)methyl)cyclopropyl)phenyl)-1-(4-methoxyphenyl)-3-(trifluoromethyl)-5,6-dihydro-1H-pyrazolo[3,4-c]pyridin-7(4H)-one | CHEMBL461090
TypeSmall organic molecule
Emp. Form.C29H31F3N4O2
Mol. Mass.524.5772
SMILESCOc1ccc(cc1)-n1nc(c2CCN(C(=O)c12)c1ccc(cc1)C1(CNC2CCCC2)CC1)C(F)(F)F