Reaction Details
TargetBeta-2 adrenergic receptor
LigandBDBM50243342
Substrate/Competitorn/a
Meas. Tech.ChEMBL_492277 (CHEMBL947245)
EC50>10000±n/a nM
Citation Imanishi, MItou, SWashizuka, KHamashima, HNakajima, YAraki, TTomishima, YSakurai, MMatsui, SImamura, EUeshima, KYamamoto, TYamamoto, NIshikawa, HNakano, KUnami, NHamada, KMatsumura, YTakamura, FHattori, K Discovery of a novel series of biphenyl benzoic acid derivatives as highly potent and selective human beta3 adrenergic receptor agonists with good oral bioavailability. Part II. J Med Chem51:4002-20 (2008) 
 
Beta-2 adrenergic receptor
Name:Beta-2 adrenergic receptor
Type:n/a
Mol. Mass.:46461.69
Organism:Homo sapiens (Human)
Description:P07550
Residue:413
BDBM50243342
NameBDBM50243342
Synonyms:4-(2-{[(1S,2R)-2-Hydroxy-1-methyl-2-phenylethyl]amino}ethyl)-3-isopropoxy-4-biphenylcarboxylic acid | CHEMBL453047
TypeSmall organic molecule
Emp. Form.C27H31NO4
Mol. Mass.433.5393
SMILESCC(C)Oc1cc(ccc1C(O)=O)-c1ccc(CCN[C@@H](C)[C@H](O)c2ccccc2)cc1