Reaction Details
TargetBeta-2 adrenergic receptor
LigandBDBM50243112
Substrate/Competitorn/a
Meas. Tech.ChEMBL_492277 (CHEMBL947245)
EC50>10000±n/a nM
Citation Imanishi, MItou, SWashizuka, KHamashima, HNakajima, YAraki, TTomishima, YSakurai, MMatsui, SImamura, EUeshima, KYamamoto, TYamamoto, NIshikawa, HNakano, KUnami, NHamada, KMatsumura, YTakamura, FHattori, K Discovery of a novel series of biphenyl benzoic acid derivatives as highly potent and selective human beta3 adrenergic receptor agonists with good oral bioavailability. Part II. J Med Chem51:4002-20 (2008) 
 
Beta-2 adrenergic receptor
Name:Beta-2 adrenergic receptor
Type:n/a
Mol. Mass.:46461.69
Organism:Homo sapiens (Human)
Description:P07550
Residue:413
BDBM50243112
NameBDBM50243112
Synonyms:(R)-3-(cyclohexyloxy)-4'-(2-(2-hydroxy-2-(pyridin-3-yl)ethylamino)ethyl)biphenyl-4-carboxylic acid CHEMBL488224
TypeSmall organic molecule
Emp. Form.C28H32N2O4
Mol. Mass.460.5647
SMILESO[C@@H](CNCCc1ccc(cc1)-c1ccc(C(O)=O)c(OC2CCCCC2)c1)c1cccnc1