Reaction Details
TargetProgesterone receptor
LigandBDBM50243440
Substrate/Competitorn/a
Meas. Tech.ChEMBL_491263 (CHEMBL989216)
Ki 1.2±n/a nM
Citation Pedram, Bvan Oeveren, AMais, DEMarschke, KBVerbost, PMGroen, MBZhi, L A tissue-selective nonsteroidal progesterone receptor modulator: 7,9-difluoro-5-(3-methylcyclohex-2-enyl)-2,2,4-trimethyl-1,2-dihydrochromeno[3,4-f]quinoline. J Med Chem51:3696-9 (2008) 
 
Progesterone receptor
Name:Progesterone receptor
Type:Protein
Mol. Mass.:98979.52
Organism:Homo sapiens (Human)
Description:P06401
Residue:933
BDBM50243440
NameBDBM50243440
Synonyms:(-)-7,9-difluoro-5-(6-methyl-7-oxa-bicyclo[4.1.0]hept-2-yl)-2,2,4-trimethyl 2,5-dihydro-(1H)-6-oxa-1-aza-chrysen | CHEMBL507701
TypeSmall organic molecule
Emp. Form.C26H27F2NO2
Mol. Mass.423.4949
SMILESCC1=CC(C)(C)Nc2ccc3-c4cc(F)cc(F)c4O[C@@H]([C@H]4CCC[C@@]5(C)O[C@@H]45)c3c12