Reaction Details
TargetHistamine H3 receptor
LigandBDBM50232355
Substrate/Competitorn/a
Meas. Tech.ChEMBL_491618 (CHEMBL945389)
Ki 0.07±n/a nM
Citation Santora, VJCovel, JAHayashi, RHofilena, BJIbarra, JBPulley, MDWeinhouse, MISemple, GRen, APereira, GEdwards, JESuarez, MFrazer, JThomsen, WHauser, ELorea, JGrottick, AJ Novel H3 receptor antagonists with improved pharmacokinetic profiles. Bioorg Med Chem Lett18:4133-6 (2008) 
 
Histamine H3 receptor
Name:Histamine H3 receptor
Type:G Protein-Coupled Receptor (GPCR)
Mol. Mass.:48607.98
Organism:Rattus norvegicus (rat)
Description:n/a
Residue:445
BDBM50232355
NameBDBM50232355
Synonyms:(3aR,6aR)-2-(cyclopropylmethyl)-6-(4-(2-(pyrrolidin-1-yl)ethyl)phenyl)-1,2,3,3a,4,6a-hexahydrocyclopenta[c]pyrrole | CHEMBL408934
TypeSmall organic molecule
Emp. Form.C23H32N2
Mol. Mass.336.5136
SMILESC(Cc1ccc(cc1)C1=CC[C@H]2CN(CC3CC3)C[C@@H]12)N1CCCC1