Reaction Details
TargetHistamine H3 receptor
LigandBDBM50243120
Substrate/Competitorn/a
Meas. Tech.ChEMBL_491618 (CHEMBL945389)
Ki 3±n/a nM
Citation Santora, VJCovel, JAHayashi, RHofilena, BJIbarra, JBPulley, MDWeinhouse, MISemple, GRen, APereira, GEdwards, JESuarez, MFrazer, JThomsen, WHauser, ELorea, JGrottick, AJ Novel H3 receptor antagonists with improved pharmacokinetic profiles. Bioorg Med Chem Lett18:4133-6 (2008) 
 
Histamine H3 receptor
Name:Histamine H3 receptor
Type:G Protein-Coupled Receptor (GPCR)
Mol. Mass.:48607.98
Organism:Rattus norvegicus (rat)
Description:n/a
Residue:445
BDBM50243120
NameBDBM50243120
Synonyms:CHEMBL520719 | cyclopentyl((3aR,6aR)-6-(4-(2-(pyrrolidin-1-yl)ethyl)phenyl)-1,3a,4,6a-tetrahydrocyclopenta[c]pyrrol-2(1H)-yl)methanone
TypeSmall organic molecule
Emp. Form.C25H34N2O
Mol. Mass.378.5503
SMILESO=C(C1CCCC1)N1C[C@@H]2CC=C([C@@H]2C1)c1ccc(CCN2CCCC2)cc1