Reaction Details
TargetHistamine H3 receptor
LigandBDBM50243674
Substrate/Competitorn/a
Meas. Tech.ChEMBL_491620 (CHEMBL945391)
Ki 4±n/a nM
Citation Santora, VJCovel, JAHayashi, RHofilena, BJIbarra, JBPulley, MDWeinhouse, MISemple, GRen, APereira, GEdwards, JESuarez, MFrazer, JThomsen, WHauser, ELorea, JGrottick, AJ Novel H3 receptor antagonists with improved pharmacokinetic profiles. Bioorg Med Chem Lett18:4133-6 (2008) 
 
Histamine H3 receptor
Name:Histamine H3 receptor
Type:G Protein-Coupled Receptor (GPCR)
Mol. Mass.:48691.47
Organism:Homo sapiens (Human)
Description:Binding assays were using CHO cells stably expressing hH3R receptors.
Residue:445
BDBM50243674
NameBDBM50243674
Synonyms:((3aR,6aR)-6-(4-(2-((R)-2-methylpyrrolidin-1-yl)ethyl)phenyl)-1,3a,4,6a-tetrahydrocyclopenta[c]pyrrol-2(1H)-yl)(tetrahydro-2H-pyran-4-yl)methanone | CHEMBL471555
TypeSmall organic molecule
Emp. Form.C26H36N2O2
Mol. Mass.408.5762
SMILESC[C@@H]1CCCN1CCc1ccc(cc1)C1=CC[C@H]2CN(C[C@@H]12)C(=O)C1CCOCC1