Reaction Details
TargetFalcipain 2
LigandBDBM50243232
Substrate/Competitorn/a
Meas. Tech.ChEMBL_491630 (CHEMBL945401)
IC50 2±n/a nM
Citation Verissimo, EBerry, NGibbons, PCristiano, MLRosenthal, PJGut, JWard, SAO'Neill, PM Design and synthesis of novel 2-pyridone peptidomimetic falcipain 2/3 inhibitors. Bioorg Med Chem Lett18:4210-4 (2008) 
 
Falcipain 2
Name:Falcipain 2
Type:Enzyme
Mol. Mass.:55912.60
Organism:Plasmodium falciparum
Description:Recombinant falcipain-2.
Residue:484
BDBM50243232
NameBDBM50243232
Synonyms:CHEMBL486232 N-((S)-4-methyl-1-oxo-1-((S)-5-phenyl-1-(phenylsulfonyl)pent-1-en-3-ylamino)pentan-2-yl)morpholine-4-carboxamide | N~2~-(MORPHOLIN-4-YLCARBONYL)-N~1~-[(1S,2E)-1-(2-PHENYLETHYL)-3-(PHENYLSULFONYL)PROP-2-ENYL]-D-LEUCINAMIDE
TypeSmall organic molecule
Emp. Form.C28H37N3O5S
Mol. Mass.527.675
SMILESCC(C)C[C@H](NC(=O)N1CCOCC1)C(=O)N[C@@H](CCc1ccccc1)C=CS(=O)(=O)c1ccccc1