Reaction Details
TargetMast/stem cell growth factor receptor Kit
LigandBDBM26373
Substrate/Competitorn/a
Meas. Tech.ChEMBL_491668 (CHEMBL946386)
IC50 14±n/a nM
Citation Chen, NBürli, RWNeira, SHungate, RZhang, DYu, VNguyen, YTudor, YPlant, MFlynn, SMeagher, KLLee, MRZhang, XItano, ASchrag, MXu, YNg, GYHu, E Discovery of a potent and selective c-Kit inhibitor for the treatment of inflammatory diseases. Bioorg Med Chem Lett18:4137-41 (2008) 
 
Mast/stem cell growth factor receptor Kit
Name:Mast/stem cell growth factor receptor Kit
Type:Protein
Mol. Mass.:109869.37
Organism:Homo sapiens (Human)
Description:P10721
Residue:976
BDBM26373
NameBDBM26373
Synonyms:4-methyl-3-N-(pyrimidin-5-yl)-1-N-[3-(trifluoromethyl)benzene]benzene-1,3-dicarboxamide unsubstituted pyrimidine amide, 37
TypeSmall organic molecule
Emp. Form.C20H15F3N4O2
Mol. Mass.400.3539
SMILESCc1ccc(NC(=O)c2cccc(c2)C(F)(F)F)cc1C(=O)Nc1cncnc1