Reaction Details
TargetDipeptidyl peptidase 4
LigandBDBM50243649
Substrate/Competitorn/a
Meas. Tech.ChEMBL_492003 (CHEMBL938686)
IC50 290±n/a nM
Citation Van der Veken, PDe Meester, IDubois, VSoroka, AVan Goethem, SMaes, MBBrandt, ILambeir, AMChen, XHaemers, AScharpé, SAugustyns, K Inhibitors of dipeptidyl peptidase 8 and dipeptidyl peptidase 9. Part 1: identification of dipeptide derived leads. Bioorg Med Chem Lett18:4154-8 (2008) 
 
Dipeptidyl peptidase 4
Name:Dipeptidyl peptidase 4
Type:Enzyme
Mol. Mass.:88271.01
Organism:Homo sapiens (Human)
Description:P27487
Residue:766
BDBM50243649
NameBDBM50243649
Synonyms:(2S,4S)-1-((2S,3R)-2-amino-3-methylpentanoyl)-4-azidopyrrolidine-2-carbonitrile | CHEMBL471547
TypeSmall organic molecule
Emp. Form.C11H18N6O
Mol. Mass.250.3002
SMILESCC[C@@H](C)[C@H](N)C(=O)N1C[C@H](C[C@H]1C#N)N=[N+]=[N-]