Reaction Details
TargetDipeptidyl peptidase 8
LigandBDBM50243649
Substrate/Competitorn/a
Meas. Tech.ChEMBL_492001 (CHEMBL938684)
IC50 11±n/a nM
Citation Van der Veken, PDe Meester, IDubois, VSoroka, AVan Goethem, SMaes, MBBrandt, ILambeir, AMChen, XHaemers, AScharpé, SAugustyns, K Inhibitors of dipeptidyl peptidase 8 and dipeptidyl peptidase 9. Part 1: identification of dipeptide derived leads. Bioorg Med Chem Lett18:4154-8 (2008) 
 
Dipeptidyl peptidase 8
Name:Dipeptidyl peptidase 8
Type:Enzyme
Mol. Mass.:103342.62
Organism:Homo sapiens (Human)
Description:Q6V1X1
Residue:898
BDBM50243649
NameBDBM50243649
Synonyms:(2S,4S)-1-((2S,3R)-2-amino-3-methylpentanoyl)-4-azidopyrrolidine-2-carbonitrile | CHEMBL471547
TypeSmall organic molecule
Emp. Form.C11H18N6O
Mol. Mass.250.3002
SMILESCC[C@@H](C)[C@H](N)C(=O)N1C[C@H](C[C@H]1C#N)N=[N+]=[N-]