Reaction Details
TargetDipeptidyl peptidase 2
LigandBDBM11695
Substrate/Competitorn/a
Meas. Tech.ChEMBL_492004 (CHEMBL938687)
IC50>1000000±n/a nM
Citation Van der Veken, PDe Meester, IDubois, VSoroka, AVan Goethem, SMaes, MBBrandt, ILambeir, AMChen, XHaemers, AScharpé, SAugustyns, K Inhibitors of dipeptidyl peptidase 8 and dipeptidyl peptidase 9. Part 1: identification of dipeptide derived leads. Bioorg Med Chem Lett18:4154-8 (2008) 
 
Dipeptidyl peptidase 2
Name:Dipeptidyl peptidase 2
Type:Protein
Mol. Mass.:54339.29
Organism:Homo sapiens (Human)
Description:Q9UHL4
Residue:492
BDBM11695
NameBDBM11695
Synonyms:(2S)-1-{2-[(3-hydroxyadamantan-1-yl)amino]acetyl}pyrrolidine-2-carbonitrile NVP-LAF237
TypeSmall organic molecule
Emp. Form.C17H25N3O2
Mol. Mass.303.3993
SMILESOC12CC3CC(C1)CC(C3)(C2)NCC(=O)N1CCC[C@H]1C#N