Reaction Details
TargetDipeptidyl peptidase 2
LigandBDBM11464
Substrate/Competitorn/a
Meas. Tech.ChEMBL_492004 (CHEMBL938687)
IC50 28000±n/a nM
Citation Van der Veken, PDe Meester, IDubois, VSoroka, AVan Goethem, SMaes, MBBrandt, ILambeir, AMChen, XHaemers, AScharpé, SAugustyns, K Inhibitors of dipeptidyl peptidase 8 and dipeptidyl peptidase 9. Part 1: identification of dipeptide derived leads. Bioorg Med Chem Lett18:4154-8 (2008) 
 
Dipeptidyl peptidase 2
Name:Dipeptidyl peptidase 2
Type:Protein
Mol. Mass.:54339.29
Organism:Homo sapiens (Human)
Description:Q9UHL4
Residue:492
BDBM11464
NameBDBM11464
Synonyms:(2S,3S)-2-amino-3-methyl-1-(1,3-thiazolidin-3-yl)pentan-1-one CHEMBL98408 thiazolidide 2
TypeSmall organic molecule
Emp. Form.C9H18N2OS
Mol. Mass.202.317
SMILESCC[C@H](C)[C@H](N)C(=O)N1CCSC1