Reaction Details
TargetLeucyl-cystinyl aminopeptidase
LigandBDBM85550
Substrate/Competitorn/a
Meas. Tech.ChEMBL_492335 (CHEMBL948331)
Ki 60±n/a nM
Citation Andersson, HDemaegdt, HVauquelin, GLindeberg, GKarlén, AHallberg, M Ligands to the (IRAP)/AT4 receptor encompassing a 4-hydroxydiphenylmethane scaffold replacing Tyr2. Bioorg Med Chem16:6924-35 (2008) 
 
Leucyl-cystinyl aminopeptidase
Name:Leucyl-cystinyl aminopeptidase
Type:PROTEIN
Mol. Mass.:117334.10
Organism:Homo sapiens (Human)
Description:ChEMBL_1473494
Residue:1025
BDBM85550
NameBDBM85550
Synonyms:Ang IV CHEMBL261120 | cid_123814
TypeSmall organic molecule
Emp. Form.C40H54N8O8
Mol. Mass.774.9056
SMILESCC[C@H](C)[C@H](NC(=O)[C@H](Cc1ccc(O)cc1)NC(=O)[C@@H](N)C(C)C)C(=O)N[C@@H](Cc1cnc[nH]1)C(=O)N1CCC[C@H]1C(=O)N[C@@H](Cc1ccccc1)C(O)=O