Reaction Details
TargetLeucyl-cystinyl aminopeptidase
LigandBDBM50242868
Substrate/Competitorn/a
Meas. Tech.ChEMBL_492335 (CHEMBL948331)
Ki 1300±n/a nM
Citation Andersson, HDemaegdt, HVauquelin, GLindeberg, GKarlén, AHallberg, M Ligands to the (IRAP)/AT4 receptor encompassing a 4-hydroxydiphenylmethane scaffold replacing Tyr2. Bioorg Med Chem16:6924-35 (2008) 
 
Leucyl-cystinyl aminopeptidase
Name:Leucyl-cystinyl aminopeptidase
Type:PROTEIN
Mol. Mass.:117334.10
Organism:Homo sapiens (Human)
Description:ChEMBL_1473494
Residue:1025
BDBM50242868
NameBDBM50242868
Synonyms:2-(((2S,3R)-2-(3-(4-hydroxybenzyl)-5-((S)-2-amino-3-methylbutanamido)benzamido)-3-methylpentanamido)methyl)benzoic acid | CHEMBL499984
TypeSmall organic molecule
Emp. Form.C33H40N4O6
Mol. Mass.588.6939
SMILESCC[C@@H](C)[C@H](NC(=O)c1cc(Cc2ccc(O)cc2)cc(NC(=O)[C@@H](N)C(C)C)c1)C(=O)NCc1ccccc1C(O)=O