Reaction Details
TargetThymidine kinase, cytosolic
LigandBDBM50243089
Substrate/Competitorn/a
Meas. Tech.ChEMBL_492345 (CHEMBL948341)
IC50 10000±n/a nM
Citation Gerland, BDésiré, JBalzarini, JDécout, JL Anti-retroviral and cytostatic activity of 2',3'-dideoxyribonucleoside 3'-disulfides. Bioorg Med Chem16:6824-31 (2008) 
 
Thymidine kinase, cytosolic
Name:Thymidine kinase, cytosolic
Type:PROTEIN
Mol. Mass.:25476.50
Organism:Homo sapiens (Human)
Description:ChEMBL_1333884
Residue:234
BDBM50243089
NameBDBM50243089
Synonyms:2',3'-Dideoxy-3'-(2-aminoethyldithio)thymidine | CHEMBL487410
TypeSmall organic molecule
Emp. Form.C12H19N3O4S2
Mol. Mass.333.427
SMILESCc1cn([C@H]2C[C@H](SSCCN)[C@@H](CO)O2)c(=O)[nH]c1=O