Reaction Details
TargetThymidine kinase, cytosolic
LigandBDBM50242983
Substrate/Competitorn/a
Meas. Tech.ChEMBL_492345 (CHEMBL948341)
IC50 18000±n/a nM
Citation Gerland, BDésiré, JBalzarini, JDécout, JL Anti-retroviral and cytostatic activity of 2',3'-dideoxyribonucleoside 3'-disulfides. Bioorg Med Chem16:6824-31 (2008) 
 
Thymidine kinase, cytosolic
Name:Thymidine kinase, cytosolic
Type:PROTEIN
Mol. Mass.:25476.50
Organism:Homo sapiens (Human)
Description:ChEMBL_1333884
Residue:234
BDBM50242983
NameBDBM50242983
Synonyms:2',3'-Dideoxy-3'-(2-hydroxyethyldithio)thymidine | CHEMBL470689
TypeSmall organic molecule
Emp. Form.C12H18N2O5S2
Mol. Mass.334.412
SMILESCc1cn([C@H]2C[C@H](SSCCO)[C@@H](CO)O2)c(=O)[nH]c1=O