Reaction Details
TargetVascular endothelial growth factor receptor 2
LigandBDBM50243417
Substrate/Competitorn/a
Meas. Tech.ChEMBL_492359 (CHEMBL948355)
IC50 0.7±n/a nM
Citation Frey, RRCurtin, MLAlbert, DHGlaser, KBPease, LJSoni, NBBouska, JJReuter, DStewart, KDMarcotte, PBukofzer, GLi, JDavidsen, SKMichaelides, MR 7-Aminopyrazolo[1,5-a]pyrimidines as potent multitargeted receptor tyrosine kinase inhibitors. J Med Chem51:3777-87 (2008) 
 
Vascular endothelial growth factor receptor 2
Name:Vascular endothelial growth factor receptor 2
Type:Receptor Tyrosine Kinase
Mol. Mass.:151510.97
Organism:Homo sapiens (Human)
Description:P35968
Residue:1356
BDBM50243417
NameBDBM50243417
Synonyms:1-{4-[7-Amino-3-(1-methyl-1H-pyrazol-4-yl)pyrazolo[1,5-a]pyrimidin-6-yl]phenyl}-3-(3-trifluoromethylphenyl)urea | CHEMBL453057
TypeSmall organic molecule
Emp. Form.C25H23N7O
Mol. Mass.437.4964
SMILESCc1cccc(NC(=O)Nc2ccc(cc2)-c2cnc3c(ccn3c2N)-c2cnn(C)c2)c1