Reaction Details
TargetTranslocator protein
LigandBDBM50243005
Substrate/Competitorn/a
Meas. Tech.ChEMBL_492376 (CHEMBL948372)
Ki 3.3±n/a nM
Citation Fookes, CJPham, TQMattner, FGreguric, ILoc'h, CLiu, XBerghofer, PShepherd, RGregoire, MCKatsifis, A Synthesis and biological evaluation of substituted [18F]imidazo[1,2-a]pyridines and [18F]pyrazolo[1,5-a]pyrimidines for the study of the peripheral benzodiazepine receptor using positron emission tomography. J Med Chem51:3700-12 (2008) 
 
Translocator protein
Name:Translocator protein
Type:Mitochondrion membrane protein
Mol. Mass.:18945.84
Organism:Rattus norvegicus (rat)
Description:Competitive binding experiments were performed on rat kidney mitochondrial membranes.
Residue:169
BDBM50243005
NameBDBM50243005
Synonyms:2-(6-Chloro-2-(4-(2-fluoroethoxy)phenyl)imidazo[1,2-a]pyridin-3-yl)-N,N-diethylacetamide | CHEMBL469680
TypeSmall organic molecule
Emp. Form.C21H23ClFN3O2
Mol. Mass.403.878
SMILESCCN(CC)C(=O)Cc1c(nc2ccc(Cl)cn12)-c1ccc(OCCF)cc1