Reaction Details
TargetSodium-dependent noradrenaline transporter
LigandBDBM50243016
Substrate/Competitorn/a
Meas. Tech.ChEMBL_487421 (CHEMBL1020015)
Ki 61±n/a nM
Citation Mahaney, PEGavrin, LKTrybulski, EJStack, GPVu, TACohn, STYe, FBelardi, JKSantilli, AASabatucci, JPLeiter, JJohnston, GHBray, JABurroughs, KDCosmi, SALeventhal, LKoury, EJZhang, YMugford, CAHo, DMRosenzweig-Lipson, SJPlatt, BSmith, VADeecher, DC Structure-activity relationships of the cycloalkanol ethylamine scaffold: discovery of selective norepinephrine reuptake inhibitors. J Med Chem51:4038-49 (2008) 
 
Sodium-dependent noradrenaline transporter
Name:Sodium-dependent noradrenaline transporter
Type:Multi-pass membrane protein
Mol. Mass.:69337.72
Organism:Homo sapiens (Human)
Description:P23975
Residue:617
BDBM50243016
NameBDBM50243016
Synonyms:1-{2-(3-Methylpiperazin-1-yl)-1-[3-(trifluoromethyl)phenyl]ethyl}cyclohexanol Dihydrocholoride | CHEMBL469475
TypeSmall organic molecule
Emp. Form.C20H29F3N2O
Mol. Mass.370.4523
SMILESCN1CCN(CC(c2cccc(c2)C(F)(F)F)C2(O)CCCCC2)CC1