Reaction Details
TargetSodium-dependent noradrenaline transporter
LigandBDBM50243014
Substrate/Competitorn/a
Meas. Tech.ChEMBL_487421 (CHEMBL1020015)
Ki 544±n/a nM
Citation Mahaney, PEGavrin, LKTrybulski, EJStack, GPVu, TACohn, STYe, FBelardi, JKSantilli, AASabatucci, JPLeiter, JJohnston, GHBray, JABurroughs, KDCosmi, SALeventhal, LKoury, EJZhang, YMugford, CAHo, DMRosenzweig-Lipson, SJPlatt, BSmith, VADeecher, DC Structure-activity relationships of the cycloalkanol ethylamine scaffold: discovery of selective norepinephrine reuptake inhibitors. J Med Chem51:4038-49 (2008) 
 
Sodium-dependent noradrenaline transporter
Name:Sodium-dependent noradrenaline transporter
Type:Multi-pass membrane protein
Mol. Mass.:69337.72
Organism:Homo sapiens (Human)
Description:P23975
Residue:617
BDBM50243014
NameBDBM50243014
Synonyms:(-)-1-{(1R)-2-Piperazin-1-yl-1-[3-(trifluoromethoxy)phenyl]ethyl}cyclohexanol Dihydrochloride | CHEMBL470481
TypeSmall organic molecule
Emp. Form.C19H27F3N2O2
Mol. Mass.372.4251
SMILESOC1(CCCCC1)[C@@H](CN1CCNCC1)c1cccc(OC(F)(F)F)c1