Reaction Details
TargetSodium-dependent noradrenaline transporter
LigandBDBM50242921
Substrate/Competitorn/a
Meas. Tech.ChEMBL_487421 (CHEMBL1020015)
Ki 519±n/a nM
Citation Mahaney, PEGavrin, LKTrybulski, EJStack, GPVu, TACohn, STYe, FBelardi, JKSantilli, AASabatucci, JPLeiter, JJohnston, GHBray, JABurroughs, KDCosmi, SALeventhal, LKoury, EJZhang, YMugford, CAHo, DMRosenzweig-Lipson, SJPlatt, BSmith, VADeecher, DC Structure-activity relationships of the cycloalkanol ethylamine scaffold: discovery of selective norepinephrine reuptake inhibitors. J Med Chem51:4038-49 (2008) 
 
Sodium-dependent noradrenaline transporter
Name:Sodium-dependent noradrenaline transporter
Type:Multi-pass membrane protein
Mol. Mass.:69337.72
Organism:Homo sapiens (Human)
Description:P23975
Residue:617
BDBM50242921
NameBDBM50242921
Synonyms:1-[1-(4-Methoxyphenyl)-2-piperazin-1-ylethyl]cyclohexanol Dihydrochloride | CHEMBL469458
TypeSmall organic molecule
Emp. Form.C19H30N2O2
Mol. Mass.318.4537
SMILESCOc1ccc(cc1)C(CN1CCNCC1)C1(O)CCCCC1