Reaction Details
TargetSodium-dependent noradrenaline transporter
LigandBDBM50243464
Substrate/Competitorn/a
Meas. Tech.ChEMBL_487421 (CHEMBL1020015)
Ki 41±n/a nM
Citation Mahaney, PEGavrin, LKTrybulski, EJStack, GPVu, TACohn, STYe, FBelardi, JKSantilli, AASabatucci, JPLeiter, JJohnston, GHBray, JABurroughs, KDCosmi, SALeventhal, LKoury, EJZhang, YMugford, CAHo, DMRosenzweig-Lipson, SJPlatt, BSmith, VADeecher, DC Structure-activity relationships of the cycloalkanol ethylamine scaffold: discovery of selective norepinephrine reuptake inhibitors. J Med Chem51:4038-49 (2008) 
 
Sodium-dependent noradrenaline transporter
Name:Sodium-dependent noradrenaline transporter
Type:Multi-pass membrane protein
Mol. Mass.:69337.72
Organism:Homo sapiens (Human)
Description:P23975
Residue:617
BDBM50243464
NameBDBM50243464
Synonyms:(-)-1-[(1R)-1-(3-Chlorophenyl)-2-(dimethylamino)ethyl]cyclohexanol | CHEMBL461095
TypeSmall organic molecule
Emp. Form.C16H24ClNO
Mol. Mass.281.821
SMILESCN(C)C[C@@H](c1cccc(Cl)c1)C1(O)CCCCC1